BDBM576428 WO2022115301, Example 14
SMILES CC(C)(O)[C@@H](C1CC1)N1Cc2cccc(c2C1=O)-c1cccc(OCC(F)(F)F)c1
InChI Key InChIKey=BPCGDDFNLNFZPH-HXUWFJFHSA-N
Data  1 EC50
  Tab Delimited (TSV)   2D SDfile   Computed 3D by Vconf -m prep SDfile
Find this compound or compounds like it in BindingDB:
Activity Spreadsheet -- Enzyme Inhibition Constant Data from BindingDB
Found 1 hit for monomerid = 576428
TargetCeramide glucosyltransferase(Homo sapiens (Human))
Merck Sharp &Amp
WIPO
LigandPNGBDBM576428(WO2022115301, Example 14)
Affinity DataEC50:  48nM. Assay description:  Using Promega’s UDP-Glo™ Glycosyltransferase assay kit (Promega Corporation, Madison, WI, USA (Promega)), GCS activity was indirectly measured by de...
Ligand InfoPC cidPC sid
In DepthDetails PubMed