BDBM576429 WO2022115301, Example 15
SMILES Cn1cc(cn1)-c1ccc(cc1)-c1cccc2CN([C@H](C3CC3)C(C)(C)O)C(=O)c12
InChI Key InChIKey=KRCZPCNHCKMYEL-HSZRJFAPSA-N
Data  1 EC50
  Tab Delimited (TSV)   2D SDfile   Computed 3D by Vconf -m prep SDfile
Find this compound or compounds like it in BindingDB:
Activity Spreadsheet -- Enzyme Inhibition Constant Data from BindingDB
Found 1 hit for monomerid = 576429
TargetCeramide glucosyltransferase(Homo sapiens (Human))
Merck Sharp &Amp
WIPO
LigandPNGBDBM576429(WO2022115301, Example 15)
Affinity DataEC50:  6.40nM. Assay description:  Using Promega’s UDP-Glo™ Glycosyltransferase assay kit (Promega Corporation, Madison, WI, USA (Promega)), GCS activity was indirectly measured by de...
Ligand InfoPC cidPC sid
In DepthDetails PubMed