BDBM584547 US11524968, Example 295
SMILES CCC1CN(CC=C1c1cc(NC(=O)C2CC2)nc2[nH]ccc12)C(=O)CCC#N
InChI Key
Data  1 IC50
  Tab Delimited (TSV)   2D SDfile   Computed 3D by Vconf -m prep SDfile
Find this compound or compounds like it in BindingDB:
Activity Spreadsheet -- Enzyme Inhibition Constant Data from BindingDB
Found 1 hit for monomerid = 584547
TargetTyrosine-protein kinase JAK1(Homo sapiens (Human))
Hk Inno.N
US Patent
LigandPNGBDBM584547(US11524968, Example 295)
Affinity DataIC50: <20nM. Assay description: A control material and a test material were prepared for each concentration, in such a way that they were diluted by means of DMSO. At the same time,...
Ligand InfoPC cidPC sid
In DepthDetails US Patent