BDBM585368 US11530209, Compound A10
SMILES Oc1ccc2ccccc2c1-c1nc2ccccn2c1NC1CCCCC1
InChI Key InChIKey=GCGTUVGCUSOIMQ-UHFFFAOYSA-N
Data  1 IC50
  Tab Delimited (TSV)   2D SDfile   Computed 3D by Vconf -m prep SDfile
Find this compound or compounds like it in BindingDB:
Activity Spreadsheet -- Enzyme Inhibition Constant Data from BindingDB
Found 1 hit for monomerid = 585368
TargetSal-like protein 4(Human)
Dana-Farber Cancer Institute
US Patent
LigandPNGBDBM585368(US11530209, Compound A10)
Affinity DataIC50:  2.77E+3nM. Assay description: TBD
Ligand InfoPC cidPC sid
In DepthDetails US Patent