BDBM585774 US11530219, Compound 1
SMILES Fc1ccccc1Nc1nccc(NCC(=O)Nc2cccc3C(=O)N(Cc23)C2CCC(=O)NC2=O)n1
InChI Key InChIKey=PYGHGYXMTJJEGF-UHFFFAOYSA-N
Data  1 KI  1 IC50
  Tab Delimited (TSV)   2D SDfile   Computed 3D by Vconf -m prep SDfile
Find this compound or compounds like it in BindingDB:
Activity Spreadsheet -- Enzyme Inhibition Constant Data from BindingDB
Found 2 hits for monomerid = 585774
TargetProtein cereblon(Homo sapiens (Human))
Dana-Farber Cancer Institute
US Patent
LigandPNGBDBM585774(US11530219, Compound 1)
Affinity DataKi:  8.50E+3nM. Assay description: TBD
Ligand InfoPC cidPC sid
In DepthDetails US Patent
TargetProtein cereblon(Homo sapiens (Human))
Dana-Farber Cancer Institute
US Patent
LigandPNGBDBM585774(US11530219, Compound 1)
Affinity DataIC50:  2.97E+4nM. Assay description: TBD
Ligand InfoPC cidPC sid
In DepthDetails US Patent