BDBM585784 US11530219, Compound 12
SMILES CC(=O)c1ccc(cc1)-c1nccc(NCC(=O)Nc2cccc3C(=O)N(Cc23)C2CCC(=O)NC2=O)n1
InChI Key InChIKey=QJVGYLGRXWPTER-UHFFFAOYSA-N
Data  1 KI  1 IC50
  Tab Delimited (TSV)   2D SDfile   Computed 3D by Vconf -m prep SDfile
Find this compound or compounds like it in BindingDB:
Activity Spreadsheet -- Enzyme Inhibition Constant Data from BindingDB
Found 2 hits for monomerid = 585784
TargetProtein cereblon(Homo sapiens (Human))
Dana-Farber Cancer Institute
US Patent
LigandPNGBDBM585784(US11530219, Compound 12)
Affinity DataKi:  3.90E+3nM. Assay description: TBD
Ligand InfoPC cidPC sid
In DepthDetails US Patent
TargetProtein cereblon(Homo sapiens (Human))
Dana-Farber Cancer Institute
US Patent
LigandPNGBDBM585784(US11530219, Compound 12)
Affinity DataIC50:  1.38E+4nM. Assay description: TBD
Ligand InfoPC cidPC sid
In DepthDetails US Patent