BDBM585787 US11530219, Compound 15
SMILES COc1ccccc1Nc1nccc(NCC(=O)Nc2cccc3C(=O)N(Cc23)C2CCC(=O)NC2=O)n1
InChI Key InChIKey=DTVIIAPUEAVPGV-UHFFFAOYSA-N
Data  1 KI  1 IC50
  Tab Delimited (TSV)   2D SDfile   Computed 3D by Vconf -m prep SDfile
Find this compound or compounds like it in BindingDB:
Activity Spreadsheet -- Enzyme Inhibition Constant Data from BindingDB
Found 2 hits for monomerid = 585787
TargetProtein cereblon(Homo sapiens (Human))
Dana-Farber Cancer Institute
US Patent
LigandPNGBDBM585787(US11530219, Compound 15)
Affinity DataKi:  4.30E+3nM. Assay description: TBD
Ligand InfoPC cidPC sid
In DepthDetails US Patent
TargetProtein cereblon(Homo sapiens (Human))
Dana-Farber Cancer Institute
US Patent
LigandPNGBDBM585787(US11530219, Compound 15)
Affinity DataIC50:  1.52E+4nM. Assay description: TBD
Ligand InfoPC cidPC sid
In DepthDetails US Patent