BDBM589840 US11559538, Example 94::US11559538, Example 95
SMILES CCOc1c(OC)ccc(-c2cncc(c2)C2COB(O)C2)c1C(F)(F)F
InChI Key InChIKey=VQEACQKFEPTUPD-UHFFFAOYSA-N
Data  8 IC50
  Tab Delimited (TSV)   2D SDfile   Computed 3D by Vconf -m prep SDfile
Find this compound or compounds like it in BindingDB:
Activity Spreadsheet -- Enzyme Inhibition Constant Data from BindingDB
Found 8 hits for monomerid = 589840
TargetInterferon gamma receptor 1(Homo sapiens (Human))
Pfizer
US Patent
LigandPNGBDBM589840(US11559538, Example 94 | US11559538, Example 95)
Affinity DataIC50:  3.88nM
Ligand InfoPC cidPC sid
In DepthDetails US Patent
TargetIsoform PDE4B2 of cAMP-specific 3',5'-cyclic phosphodiesterase 4B(Homo sapiens (Human))
Pfizer
US Patent
LigandPNGBDBM589840(US11559538, Example 94 | US11559538, Example 95)
Affinity DataIC50:  4.87nM. Assay description: Cytokine inhibitory activity is determined by measuring the effect of test agent on the release of the cytokines IL-4, IL-13 and IFNγ from human...
Ligand InfoPC cidPC sid
In DepthDetails US Patent
TargetInterleukin-13(Human)
Pfizer
US Patent
LigandPNGBDBM589840(US11559538, Example 94 | US11559538, Example 95)
Affinity DataIC50:  461nM
Ligand InfoPC cidPC sid
In DepthDetails US Patent
TargetInterleukin-4(Human)
Pfizer
US Patent
LigandPNGBDBM589840(US11559538, Example 94 | US11559538, Example 95)
Affinity DataIC50:  9.58nM
Ligand InfoPC cidPC sid
In DepthDetails US Patent
TargetInterferon gamma receptor 1(Homo sapiens (Human))
Pfizer
US Patent
LigandPNGBDBM589840(US11559538, Example 94 | US11559538, Example 95)
Affinity DataIC50:  2.87nM
Ligand InfoPC cidPC sid
In DepthDetails US Patent
TargetIsoform PDE4B2 of cAMP-specific 3',5'-cyclic phosphodiesterase 4B(Homo sapiens (Human))
Pfizer
US Patent
LigandPNGBDBM589840(US11559538, Example 94 | US11559538, Example 95)
Affinity DataIC50:  12.5nM. Assay description: Cytokine inhibitory activity is determined by measuring the effect of test agent on the release of the cytokines IL-4, IL-13 and IFNγ from human...
Ligand InfoPC cidPC sid
In DepthDetails US Patent
TargetInterleukin-13(Human)
Pfizer
US Patent
LigandPNGBDBM589840(US11559538, Example 94 | US11559538, Example 95)
Affinity DataIC50:  606nM
Ligand InfoPC cidPC sid
In DepthDetails US Patent
TargetInterleukin-4(Human)
Pfizer
US Patent
LigandPNGBDBM589840(US11559538, Example 94 | US11559538, Example 95)
Affinity DataIC50:  7.36nM
Ligand InfoPC cidPC sid
In DepthDetails US Patent