BDBM589845 US11559538, Example 100::US11559538, Example 101::US11559538, Example 99
SMILES CSc1ccc(cc1OC1CCCC1)-c1cncc(c1)C1COB(O)C1
InChI Key InChIKey=IWYDIUXHYHHGPB-UHFFFAOYSA-N
Data  12 IC50
  Tab Delimited (TSV)   2D SDfile   Computed 3D by Vconf -m prep SDfile
Find this compound or compounds like it in BindingDB:
Activity Spreadsheet -- Enzyme Inhibition Constant Data from BindingDB
Found 12 hits for monomerid = 589845
TargetIsoform PDE4B2 of cAMP-specific 3',5'-cyclic phosphodiesterase 4B(Homo sapiens (Human))
Pfizer
US Patent
LigandPNGBDBM589845(US11559538, Example 100 | US11559538, Example 101 ...)
Affinity DataIC50:  1.37nM. Assay description: Cytokine inhibitory activity is determined by measuring the effect of test agent on the release of the cytokines IL-4, IL-13 and IFNγ from human...
Ligand InfoPC cidPC sid
In DepthDetails US Patent
TargetInterleukin-13(Human)
Pfizer
US Patent
LigandPNGBDBM589845(US11559538, Example 100 | US11559538, Example 101 ...)
Affinity DataIC50:  957nM
Ligand InfoPC cidPC sid
In DepthDetails US Patent
TargetInterleukin-4(Human)
Pfizer
US Patent
LigandPNGBDBM589845(US11559538, Example 100 | US11559538, Example 101 ...)
Affinity DataIC50:  44.3nM
Ligand InfoPC cidPC sid
In DepthDetails US Patent
TargetInterferon gamma receptor 1(Homo sapiens (Human))
Pfizer
US Patent
LigandPNGBDBM589845(US11559538, Example 100 | US11559538, Example 101 ...)
Affinity DataIC50:  9.42nM
Ligand InfoPC cidPC sid
In DepthDetails US Patent
TargetIsoform PDE4B2 of cAMP-specific 3',5'-cyclic phosphodiesterase 4B(Homo sapiens (Human))
Pfizer
US Patent
LigandPNGBDBM589845(US11559538, Example 100 | US11559538, Example 101 ...)
Affinity DataIC50:  1.68nM. Assay description: Cytokine inhibitory activity is determined by measuring the effect of test agent on the release of the cytokines IL-4, IL-13 and IFNγ from human...
Ligand InfoPC cidPC sid
In DepthDetails US Patent
TargetInterferon gamma receptor 1(Homo sapiens (Human))
Pfizer
US Patent
LigandPNGBDBM589845(US11559538, Example 100 | US11559538, Example 101 ...)
Affinity DataIC50:  13.3nM
Ligand InfoPC cidPC sid
In DepthDetails US Patent
TargetInterleukin-4(Human)
Pfizer
US Patent
LigandPNGBDBM589845(US11559538, Example 100 | US11559538, Example 101 ...)
Affinity DataIC50:  32.7nM
Ligand InfoPC cidPC sid
In DepthDetails US Patent
TargetInterferon gamma receptor 1(Homo sapiens (Human))
Pfizer
US Patent
LigandPNGBDBM589845(US11559538, Example 100 | US11559538, Example 101 ...)
Affinity DataIC50:  4.32nM
Ligand InfoPC cidPC sid
In DepthDetails US Patent
TargetIsoform PDE4B2 of cAMP-specific 3',5'-cyclic phosphodiesterase 4B(Homo sapiens (Human))
Pfizer
US Patent
LigandPNGBDBM589845(US11559538, Example 100 | US11559538, Example 101 ...)
Affinity DataIC50:  2.70nM. Assay description: Cytokine inhibitory activity is determined by measuring the effect of test agent on the release of the cytokines IL-4, IL-13 and IFNγ from human...
Ligand InfoPC cidPC sid
In DepthDetails US Patent
TargetInterleukin-13(Human)
Pfizer
US Patent
LigandPNGBDBM589845(US11559538, Example 100 | US11559538, Example 101 ...)
Affinity DataIC50:  2.65E+3nM
Ligand InfoPC cidPC sid
In DepthDetails US Patent
TargetInterleukin-4(Human)
Pfizer
US Patent
LigandPNGBDBM589845(US11559538, Example 100 | US11559538, Example 101 ...)
Affinity DataIC50:  26nM
Ligand InfoPC cidPC sid
In DepthDetails US Patent
TargetInterleukin-13(Human)
Pfizer
US Patent
LigandPNGBDBM589845(US11559538, Example 100 | US11559538, Example 101 ...)
Affinity DataIC50:  472nM
Ligand InfoPC cidPC sid
In DepthDetails US Patent