BDBM589858 US11559538, Example 112::US11559538, Example 113::US11559538, Example 114
SMILES CCCOc1cc(ccc1SC)-c1cncc(c1)C1COB(O)C1
InChI Key InChIKey=KGTGEWWRRVKTSZ-UHFFFAOYSA-N
Data  12 IC50
  Tab Delimited (TSV)   2D SDfile   Computed 3D by Vconf -m prep SDfile
Find this compound or compounds like it in BindingDB:
Activity Spreadsheet -- Enzyme Inhibition Constant Data from BindingDB
Found 12 hits for monomerid = 589858
TargetIsoform PDE4B2 of cAMP-specific 3',5'-cyclic phosphodiesterase 4B(Homo sapiens (Human))
Pfizer
US Patent
LigandPNGBDBM589858(US11559538, Example 112 | US11559538, Example 113 ...)
Affinity DataIC50:  1.41nM. Assay description: Cytokine inhibitory activity is determined by measuring the effect of test agent on the release of the cytokines IL-4, IL-13 and IFNγ from human...
Ligand InfoPC cidPC sid
In DepthDetails US Patent
TargetInterleukin-13(Human)
Pfizer
US Patent
LigandPNGBDBM589858(US11559538, Example 112 | US11559538, Example 113 ...)
Affinity DataIC50:  588nM
Ligand InfoPC cidPC sid
In DepthDetails US Patent
TargetInterleukin-4(Human)
Pfizer
US Patent
LigandPNGBDBM589858(US11559538, Example 112 | US11559538, Example 113 ...)
Affinity DataIC50:  79.9nM
Ligand InfoPC cidPC sid
In DepthDetails US Patent
TargetInterferon gamma receptor 1(Homo sapiens (Human))
Pfizer
US Patent
LigandPNGBDBM589858(US11559538, Example 112 | US11559538, Example 113 ...)
Affinity DataIC50:  8.10nM
Ligand InfoPC cidPC sid
In DepthDetails US Patent
TargetIsoform PDE4B2 of cAMP-specific 3',5'-cyclic phosphodiesterase 4B(Homo sapiens (Human))
Pfizer
US Patent
LigandPNGBDBM589858(US11559538, Example 112 | US11559538, Example 113 ...)
Affinity DataIC50:  1.38nM. Assay description: Cytokine inhibitory activity is determined by measuring the effect of test agent on the release of the cytokines IL-4, IL-13 and IFNγ from human...
Ligand InfoPC cidPC sid
In DepthDetails US Patent
TargetInterferon gamma receptor 1(Homo sapiens (Human))
Pfizer
US Patent
LigandPNGBDBM589858(US11559538, Example 112 | US11559538, Example 113 ...)
Affinity DataIC50:  21.5nM
Ligand InfoPC cidPC sid
In DepthDetails US Patent
TargetInterleukin-4(Human)
Pfizer
US Patent
LigandPNGBDBM589858(US11559538, Example 112 | US11559538, Example 113 ...)
Affinity DataIC50:  36.1nM
Ligand InfoPC cidPC sid
In DepthDetails US Patent
TargetInterferon gamma receptor 1(Homo sapiens (Human))
Pfizer
US Patent
LigandPNGBDBM589858(US11559538, Example 112 | US11559538, Example 113 ...)
Affinity DataIC50:  3.81nM
Ligand InfoPC cidPC sid
In DepthDetails US Patent
TargetIsoform PDE4B2 of cAMP-specific 3',5'-cyclic phosphodiesterase 4B(Homo sapiens (Human))
Pfizer
US Patent
LigandPNGBDBM589858(US11559538, Example 112 | US11559538, Example 113 ...)
Affinity DataIC50:  3nM. Assay description: Cytokine inhibitory activity is determined by measuring the effect of test agent on the release of the cytokines IL-4, IL-13 and IFNγ from human...
Ligand InfoPC cidPC sid
In DepthDetails US Patent
TargetInterleukin-13(Human)
Pfizer
US Patent
LigandPNGBDBM589858(US11559538, Example 112 | US11559538, Example 113 ...)
Affinity DataIC50:  2.91E+3nM
Ligand InfoPC cidPC sid
In DepthDetails US Patent
TargetInterleukin-4(Human)
Pfizer
US Patent
LigandPNGBDBM589858(US11559538, Example 112 | US11559538, Example 113 ...)
Affinity DataIC50:  32.7nM
Ligand InfoPC cidPC sid
In DepthDetails US Patent
TargetInterleukin-13(Human)
Pfizer
US Patent
LigandPNGBDBM589858(US11559538, Example 112 | US11559538, Example 113 ...)
Affinity DataIC50:  497nM
Ligand InfoPC cidPC sid
In DepthDetails US Patent