BDBM59054 4-[(7-chloranyl-4-nitro-1,3-dihydro-2,1,3-benzoxadiazol-5-yl)imino]cyclohexa-2,5-dien-1-one::4-[(7-chloro-4-nitro-1,3-dihydro-2,1,3-benzoxadiazol-5-yl)imino]-1-cyclohexa-2,5-dienone::4-[(7-chloro-4-nitro-1,3-dihydro-2,1,3-benzoxadiazol-5-yl)imino]cyclohexa-2,5-dien-1-one::4-[(7-chloro-4-nitro-1,3-dihydrobenzofurazan-5-yl)imino]cyclohexa-2,5-dien-1-one::MLS001216484::SMR000544206::cid_6061070
SMILES [O-]c1ccc(Nc2cc(Cl)c3[nH+]onc3c2[N+]([O-])=O)cc1
InChI Key InChIKey=OBXCWWZWQQDMOY-UHFFFAOYSA-N
Data  4 IC50  1 EC50
  Tab Delimited (TSV)   2D SDfile   Computed 3D by Vconf -m prep SDfile
Find this compound or compounds like it in BindingDB:
Activity Spreadsheet -- Enzyme Inhibition Constant Data from BindingDB
Found 5 hits for monomerid = 59054
TargetLarge T antigen(Simian virus 40)
Southern Research Specialized Biocontainment Screening Center
Curated by PubChem BioAssay
LigandPNGBDBM59054(4-[(7-chloranyl-4-nitro-1,3-dihydro-2,1,3-benzoxad...)
Affinity DataEC50: >5.00E+4nM. Assay description: Southern Research's Specialized Biocontainment Screening Center (SRSBSC) Southern Research Institute (Birmingham, Alabama) NIH Molecular Librarie...
In DepthDetails PCBioAssay
TargetToll-like receptor 9(Homo sapiens (Human))
The Scripps Research Institute Molecular Screening Center
Curated by PubChem BioAssay
LigandPNGBDBM59054(4-[(7-chloranyl-4-nitro-1,3-dihydro-2,1,3-benzoxad...)
Affinity DataIC50:  3.74E+3nM. Assay description: Source (MLPCN Center Name): The Scripps Research Institute Molecular Screening Center (SRIMSC) Affiliation: The Scripps Research Institute, TSRI Assa...
In DepthDetails PCBioAssay
TargetReceptor-interacting serine/threonine-protein kinase 2(Homo sapiens (Human))
The Scripps Research Institute Molecular Screening Center
Curated by PubChem BioAssay
LigandPNGBDBM59054(4-[(7-chloranyl-4-nitro-1,3-dihydro-2,1,3-benzoxad...)
Affinity DataIC50:  969nM
In DepthDetails PCBioAssay
TargetBeta-lactamase(Pseudomonas aeruginosa)
The Scripps Research Institute Molecular Screening Center
Curated by PubChem BioAssay
LigandPNGBDBM59054(4-[(7-chloranyl-4-nitro-1,3-dihydro-2,1,3-benzoxad...)
Affinity DataIC50:  5.98E+3nM
In DepthDetails PCBioAssay
TargetBeta-lactamase(Pseudomonas aeruginosa)
The Scripps Research Institute Molecular Screening Center
Curated by PubChem BioAssay
LigandPNGBDBM59054(4-[(7-chloranyl-4-nitro-1,3-dihydro-2,1,3-benzoxad...)
Affinity DataIC50:  6.38E+3nM. Assay description: Source (MLPCN Center Name): The Scripps Research Institute Molecular Screening Center (SRIMSC) Affiliation: The Scripps Research Institute, TSRI Assa...
In DepthDetails PCBioAssay