BDBM597771 US11608319, Compound 17
SMILES NCCN(Cc1ccc(F)cc1)C(=O)c1ccc(cc1)-c1cn[nH]c1
InChI Key InChIKey=AVPPHRGAVXSSMY-UHFFFAOYSA-N
Data  3 IC50
  Tab Delimited (TSV)   2D SDfile   Computed 3D by Vconf -m prep SDfile
Find this compound or compounds like it in BindingDB:
Activity Spreadsheet -- Enzyme Inhibition Constant Data from BindingDB
Found 3 hits for monomerid = 597771
TargetRho-associated protein kinase 1(Homo sapiens (Human))
Industrial Technology Research Institute
US Patent
LigandPNGBDBM597771(US11608319, Compound 17)
Affinity DataIC50:  550nM. Assay description: Table 2: Inhibitory effect of each compound synthesized above on Rho-associated protein kinase (ROCK) was tested.Method 1. 10 mM test compound was di...
Ligand InfoPC cidPC sid
In DepthDetails US Patent
TargetMitogen-activated protein kinase kinase kinase 19(Homo sapiens (Human))
Industrial Technology Research Institute
US Patent
LigandPNGBDBM597771(US11608319, Compound 17)
Affinity DataIC50: >1.00E+4nM. Assay description: Table 5: The experimental procedure referred to the Z′-LYTE Screening Protocol and Assay Conditions provided by ThermoFisher Scientific. C-1. M...
Ligand InfoPC cidPC sid
In DepthDetails US Patent
TargetMyosin light chain kinase family member 4(Homo sapiens (Human))
Industrial Technology Research Institute
US Patent
LigandPNGBDBM597771(US11608319, Compound 17)
Affinity DataIC50: >1.00E+4nM. Assay description: Table 4: Assay for Inhibitory Effect on Myosin Light Chain Kinase 4 (MYLK-4). The experimental procedure referred to the LanthaScreen Eu Kinase Bindi...
Ligand InfoPC cidPC sid
In DepthDetails US Patent