BDBM605315 US11667652, Example 109
SMILES COc1nn(C)cc1C(=O)N[S@@]1(=O)=NC(=O)c2ccc3OC[C@]4(CCCc5cc(Cl)ccc45)CN(C[C@@H]4CC[C@H]4[C@@](O)(\C=C\C[C@H](C)C1)C#CCN(C)C)c3c2
InChI Key InChIKey=USKVQVYSZVTDNO-UNURLOFASA-N
Data  1 IC50
  Tab Delimited (TSV)   2D SDfile   Computed 3D by Vconf -m prep SDfile
Find this compound or compounds like it in BindingDB:
Activity Spreadsheet -- Enzyme Inhibition Constant Data from BindingDB
Found 1 hit for monomerid = 605315
LigandPNGBDBM605315(US11667652, Example 109)
Affinity DataIC50:  0.0280nM. Assay description: Inhibition of the MCL1 and Bim interaction was measured in the following AlphaLISA assay.Recombinant human MCL1 protein (C-terminal 6×His Tagged MCL1...
Ligand InfoPC cidPC sid
In DepthDetails US Patent