BDBM605572 US11673893, Example 44
SMILES CNC(=O)N[C@@H]1CCC[C@@H](C1)C(=O)Nc1cc(c(C)cn1)-c1cc(F)c2ncn(C(C)C)c2c1
InChI Key InChIKey=SWKHRTIXNUHZMW-FUHWJXTLSA-N
Data  2 IC50
  Tab Delimited (TSV)   2D SDfile   Computed 3D by Vconf -m prep SDfile
Find this compound or compounds like it in BindingDB:
Activity Spreadsheet -- Enzyme Inhibition Constant Data from BindingDB
Found 2 hits for monomerid = 605572
TargetCyclin-T1/Cyclin-dependent kinase 9(Homo sapiens (Human))
Prelude Therapeutics
US Patent
LigandPNGBDBM605572(US11673893, Example 44)
Affinity DataIC50:  0.984nM. Assay description: The inhibitory activity of compounds was evaluated in vitro using TR-FRET assay with white 384-well low volume microplate (Greiner Bio-One). CDK4/Cyc...
Ligand InfoPC cidPC sid
In DepthDetails US Patent
TargetCyclin-dependent kinase 4/G1/S-specific cyclin-D1(Homo sapiens (Human))
Prelude Therapeutics
US Patent
LigandPNGBDBM605572(US11673893, Example 44)
Affinity DataIC50:  227nM. Assay description: The inhibitory activity of compounds was evaluated in vitro using TR-FRET assay with white 384-well low volume microplate (Greiner Bio-One). CDK2/Cyc...
Ligand InfoPC cidPC sid
In DepthDetails US Patent