BDBM605581 US11673893, Example 53
SMILES CC(=O)N[C@@H]1CCC[C@@H](C1)C(=O)Nc1cc(c(Cl)cn1)-c1cc(F)c2nn(C)c(c2c1)C(C)(C)O
InChI Key InChIKey=IALMJWAVHXWMPQ-GOEBONIOSA-N
Data  2 IC50
  Tab Delimited (TSV)   2D SDfile   Computed 3D by Vconf -m prep SDfile
Find this compound or compounds like it in BindingDB:
Activity Spreadsheet -- Enzyme Inhibition Constant Data from BindingDB
Found 2 hits for monomerid = 605581
TargetCyclin-T1/Cyclin-dependent kinase 9(Homo sapiens (Human))
Prelude Therapeutics
US Patent
LigandPNGBDBM605581(US11673893, Example 53)
Affinity DataIC50:  0.820nM. Assay description: The inhibitory activity of compounds was evaluated in vitro using TR-FRET assay with white 384-well low volume microplate (Greiner Bio-One). CDK4/Cyc...
Ligand InfoPC cidPC sid
In DepthDetails US Patent
TargetCyclin-dependent kinase 4/G1/S-specific cyclin-D1(Homo sapiens (Human))
Prelude Therapeutics
US Patent
LigandPNGBDBM605581(US11673893, Example 53)
Affinity DataIC50:  78.8nM. Assay description: The inhibitory activity of compounds was evaluated in vitro using TR-FRET assay with white 384-well low volume microplate (Greiner Bio-One). CDK2/Cyc...
Ligand InfoPC cidPC sid
In DepthDetails US Patent