BDBM605596 US11673893, Example 65
SMILES CC(C)c1n(C)nc2c(F)cc(cc12)-c1cc(NC(=O)[C@H]2CCC[C@H](C2)NC(=O)CC#N)ncc1Cl
InChI Key InChIKey=ZKDRQTUQLALDNJ-DOTOQJQBSA-N
Data  2 IC50
  Tab Delimited (TSV)   2D SDfile   Computed 3D by Vconf -m prep SDfile
Find this compound or compounds like it in BindingDB:
Activity Spreadsheet -- Enzyme Inhibition Constant Data from BindingDB
Found 2 hits for monomerid = 605596
TargetCyclin-T1/Cyclin-dependent kinase 9(Homo sapiens (Human))
Prelude Therapeutics
US Patent
LigandPNGBDBM605596(US11673893, Example 65)
Affinity DataIC50:  0.480nM. Assay description: The inhibitory activity of compounds was evaluated in vitro using TR-FRET assay with white 384-well low volume microplate (Greiner Bio-One). CDK4/Cyc...
Ligand InfoPC cidPC sid
In DepthDetails US Patent
TargetCyclin-dependent kinase 4/G1/S-specific cyclin-D1(Homo sapiens (Human))
Prelude Therapeutics
US Patent
LigandPNGBDBM605596(US11673893, Example 65)
Affinity DataIC50:  55.1nM. Assay description: The inhibitory activity of compounds was evaluated in vitro using TR-FRET assay with white 384-well low volume microplate (Greiner Bio-One). CDK2/Cyc...
Ligand InfoPC cidPC sid
In DepthDetails US Patent