BDBM611883 (2R,3R,11bR)-3-(2,2- dimethylpropyl)-10-methoxy- 9-(propan-2-yloxy)- 1H,2H,3H,4H,6H,7H,11bH- pyrido[2,1-a]isoquinolin-2-ol::US11718618, Compound 4-38
SMILES COc1cc2[C@H]3C[C@@H](O)[C@H](CC(C)(C)C)CN3CCc2cc1OC(C)C
InChI Key InChIKey=JOPIRCVKLMZTSK-BHIYHBOVSA-N
Data  1 KI
  Tab Delimited (TSV)   2D SDfile   Computed 3D by Vconf -m prep SDfile
Find this compound or compounds like it in BindingDB:
Activity Spreadsheet -- Enzyme Inhibition Constant Data from BindingDB
Found 1 hit for monomerid = 611883
TargetSynaptic vesicular amine transporter(Homo sapiens (Human))
Neurocrine Biosciences
US Patent
LigandPNGBDBM611883((2R,3R,11bR)-3-(2,2- dimethylpropyl)-10-methoxy- 9...)
Affinity DataKi:  3.70nM. Assay description: The human VMAT2 Ki values for the compounds listed in Table 15A and Table 15B were determined using the following procedures. Compound dilution serie...
Ligand InfoPC cidPC sid
In DepthDetails US Patent