BDBM61357 1-(3-pyridin-1-ium-1-ylpropyl)pyridin-1-ium;iodide::1-[3-(1-pyridin-1-iumyl)propyl]pyridin-1-ium;iodide::MLS001174940::SMR000587876::cid_24761674
SMILES C(C[n+]1ccccc1)C[n+]1ccccc1
InChI Key InChIKey=KMPKEANIOVTMHB-UHFFFAOYSA-N
Data  2 IC50
  Tab Delimited (TSV)   2D SDfile   Computed 3D by Vconf -m prep SDfile
Find this compound or compounds like it in BindingDB:
Activity Spreadsheet -- Enzyme Inhibition Constant Data from BindingDB
Found 2 hits for monomerid = 61357
TargetEukaryotic translation initiation factor 4H(Homo sapiens (Human))
Burnham Center For Chemical Genomics
Curated by PubChem BioAssay
LigandPNGBDBM61357(1-(3-pyridin-1-ium-1-ylpropyl)pyridin-1-ium;iodide...)
Affinity DataIC50:  9.65E+4nM. Assay description: Data Source: Sanford-Burnham Center for Chemical Genomics (SBCCG) Source Affiliation: Sanford-Burnham Medical Research Institute (SBMRI, San Diego, C...
In DepthDetails PCBioAssay
TargetPolyadenylate-binding protein 1(Homo sapiens (Human))
Burnham Center For Chemical Genomics
Curated by PubChem BioAssay
LigandPNGBDBM61357(1-(3-pyridin-1-ium-1-ylpropyl)pyridin-1-ium;iodide...)
Affinity DataIC50:  3.69E+3nM. Assay description: Data Source: Sanford-Burnham Center for Chemical Genomics (SBCCG) Source Affiliation: Sanford-Burnham Medical Research Institute (SBMRI, San Diego, C...
In DepthDetails PCBioAssay