BDBM614526 2-[4- (Diethylaminomethyl)- 2-fluorophenyl]-N- [(3S)-9-fluoro-2-oxo- 5-phenyl-1,3-dihydro- 1,4-benzodiazepin-3- yl]-6,7-dihydro-5H- pyrazolo[5,1- b][1,3]oxazine-3- carboxamide::US20230270751, Example 102
SMILES CCN(CC)Cc1ccc(-c2nn3CCCOc3c2C(=O)N[C@H]2N=C(c3ccccc3)c3cccc(F)c3NC2=O)c(F)c1
InChI Key InChIKey=OFIYEZYULNUZOQ-SSEXGKCCSA-N
Data  1 EC50
  Tab Delimited (TSV)   2D SDfile   Computed 3D by Vconf -m prep SDfile
Find this compound or compounds like it in BindingDB:
Activity Spreadsheet -- Enzyme Inhibition Constant Data from BindingDB
Found 1 hit for monomerid = 614526
TargetNucleoprotein(Human respiratory syncytial virus A (strain A2))
Reviral
US Patent
LigandPNGBDBM614526(2-[4- (Diethylaminomethyl)- 2-fluorophenyl]-N- [(3...)
Affinity DataEC50:  135nM. Assay description: TBD
Ligand InfoPC cidPC sid
In DepthDetails US Patent