BDBM614541 (5R)-N-[(3S)-9- fluoro-2-oxo-5- phenyl-1,3-dihydro- 1,4-benzodiazepin-3- yl]-5-methyl-2-(1- propan-2-ylpyrazol- 4-yl)-6,7-dihydro- 5H-pyrazolo[5,1- b][1,3]oxazine-3- carobxamide::US20230270751, Example 112::US20230270751, Example 120
SMILES CC(C)n1cc(cn1)-c1nn2CC[C@@H](C)Oc2c1C(=O)N[C@H]1N=C(c2ccccc2)c2cccc(F)c2NC1=O
InChI Key InChIKey=BXQZOYFDRMGLEI-WGDIFIGCSA-N
Data  2 EC50
  Tab Delimited (TSV)   2D SDfile   Computed 3D by Vconf -m prep SDfile
Find this compound or compounds like it in BindingDB:
Activity Spreadsheet -- Enzyme Inhibition Constant Data from BindingDB
Found 2 hits for monomerid = 614541
TargetNucleoprotein(Human respiratory syncytial virus A (strain A2))
Reviral
US Patent
LigandPNGBDBM614541((5R)-N-[(3S)-9- fluoro-2-oxo-5- phenyl-1,3-dihydro...)
Affinity DataEC50:  97nM. Assay description: TBD
Ligand InfoPC cidPC sid
In DepthDetails US Patent
TargetNucleoprotein(Human respiratory syncytial virus A (strain A2))
Reviral
US Patent
LigandPNGBDBM614541((5R)-N-[(3S)-9- fluoro-2-oxo-5- phenyl-1,3-dihydro...)
Affinity DataEC50:  50nM. Assay description: TBD
Ligand InfoPC cidPC sid
In DepthDetails US Patent