BDBM614542 N-[(3S)-9-fluoro-2- oxo-5-phenyl-1,3- dihydro-1,4- benzodiazepin-3-yl]- 2-(2-fluorophenyl)- 6-(methoxymethyl)- 6,7-dihydro-5H- pyrazolo[5,1- b][1,3]oxazine-3- carboxmaide::US20230270751, Example 113
SMILES COCC1COc2c(C(=O)N[C@H]3N=C(c4ccccc4)c4cccc(F)c4NC3=O)c(nn2C1)-c1ccccc1F
InChI Key InChIKey=SOKDMVYVYRHIMD-ICRYVCAISA-N
Data  1 EC50
  Tab Delimited (TSV)   2D SDfile   Computed 3D by Vconf -m prep SDfile
Find this compound or compounds like it in BindingDB:
Activity Spreadsheet -- Enzyme Inhibition Constant Data from BindingDB
Found 1 hit for monomerid = 614542
TargetNucleoprotein(Human respiratory syncytial virus A (strain A2))
Reviral
US Patent
LigandPNGBDBM614542(N-[(3S)-9-fluoro-2- oxo-5-phenyl-1,3- dihydro-1,4-...)
Affinity DataEC50:  53nM. Assay description: TBD
Ligand InfoPC cidPC sid
In DepthDetails US Patent