BDBM614629 (5S*)-2-(2- Fluorophenyl)-5- (hydroxymethyl)-N- [(3S)-9-fluoro-2-oxo- 5-phenyl-1,3-dihydro- 1,4-benzodiazepin-3- yl]-6,7-dihydro-5H- pyrazolo [5,1- b][1,3]oxazine-3- carboxamide::US20230270751, Example 190-2
SMILES OC[C@@H]1CCn2nc(c(C(=O)N[C@H]3N=C(c4ccccc4)c4cccc(F)c4NC3=O)c2O1)-c1ccccc1F
InChI Key InChIKey=OGTMJQVEGCUGCQ-MRDQGFSESA-N
Data  1 EC50
  Tab Delimited (TSV)   2D SDfile   Computed 3D by Vconf -m prep SDfile
Find this compound or compounds like it in BindingDB:
Activity Spreadsheet -- Enzyme Inhibition Constant Data from BindingDB
Found 1 hit for monomerid = 614629
TargetNucleoprotein(Human respiratory syncytial virus A (strain A2))
Reviral
US Patent
LigandPNGBDBM614629((5S*)-2-(2- Fluorophenyl)-5- (hydroxymethyl)-N- [(...)
Affinity DataEC50:  154nM. Assay description: TBD
Ligand InfoPC cidPC sid
In DepthDetails US Patent