BDBM614636 2-(2,6-Difluorophenyl)-N-[(3S)-9-fluoro-2-oxo-5-phenyl-1,3-dihydro-1,4-benzodiazepin-3-yl]-6,7-dihydro-5H-pyrazolo[5,1-b][1,3]oxazine-3-carboxamide::US20230270751, Example 196
SMILES Fc1cccc2c1NC(=O)[C@@H](NC(=O)c1c3OCCCn3nc1-c1c(F)cccc1F)N=C2c1ccccc1
InChI Key InChIKey=SPQZZWUIQGYUKN-RUZDIDTESA-N
Data  1 EC50
  Tab Delimited (TSV)   2D SDfile   Computed 3D by Vconf -m prep SDfile
Find this compound or compounds like it in BindingDB:
Activity Spreadsheet -- Enzyme Inhibition Constant Data from BindingDB
Found 1 hit for monomerid = 614636
TargetNucleoprotein(Human respiratory syncytial virus A (strain A2))
Reviral
US Patent
LigandPNGBDBM614636(2-(2,6-Difluorophenyl)-N-[(3S)-9-fluoro-2-oxo-5-ph...)
Affinity DataEC50:  25nM. Assay description: TBD
Ligand InfoPC cidPC sid
In DepthDetails US Patent