BDBM61839 (4Z)-4-[[4-(2-chlorophenyl)-1-piperazinyl]-mercaptomethylidene]-2-hydroxy-6-methoxy-1-cyclohexa-2,5-dienone::(4Z)-4-[[4-(2-chlorophenyl)piperazin-1-yl]-sulfanyl-methylidene]-2-methoxy-6-oxidanyl-cyclohexa-2,5-dien-1-one::(4Z)-4-[[4-(2-chlorophenyl)piperazin-1-yl]-sulfanylmethylidene]-2-hydroxy-6-methoxycyclohexa-2,5-dien-1-one::(4Z)-4-[[4-(2-chlorophenyl)piperazino]-mercapto-methylene]-2-hydroxy-6-methoxy-cyclohexa-2,5-dien-1-one::MLS000760186::SMR000368614::cid_6098163
SMILES COc1cc(cc(O)c1O)C(=S)N1CCN(CC1)c1ccccc1Cl
InChI Key InChIKey=BUROKOGOWXVRCQ-UHFFFAOYSA-N
Data  2 EC50
  Tab Delimited (TSV)   2D SDfile   Computed 3D by Vconf -m prep SDfile
Find this compound or compounds like it in BindingDB:
Activity Spreadsheet -- Enzyme Inhibition Constant Data from BindingDB
Found 2 hits for monomerid = 61839
TargetNeuropeptide Y receptor type 1(Homo sapiens (Human))
The Scripps Research Institute Molecular Screening Center
Curated by PubChem BioAssay
LigandPNGBDBM61839((4Z)-4-[[4-(2-chlorophenyl)-1-piperazinyl]-mercapt...)
Affinity DataEC50: >3.54E+4nM. Assay description: Source (MLPCN Center Name): The Scripps Research Institute Molecular Screening Center (SRIMSC) Center Affiliation: The Scripps Research Institute (TS...
In DepthDetails PCBioAssay
TargetNeuropeptide Y receptor type 2(Homo sapiens (Human))
The Scripps Research Institute Molecular Screening Center
Curated by PubChem BioAssay
LigandPNGBDBM61839((4Z)-4-[[4-(2-chlorophenyl)-1-piperazinyl]-mercapt...)
Affinity DataEC50: >3.54E+4nM. Assay description: Source (MLPCN Center Name): The Scripps Research Institute Molecular Screening Center (SRIMSC) Center Affiliation: The Scripps Research Institute (TS...
In DepthDetails PCBioAssay