BDBM618749 US20230293517, Example 4.27
SMILES Cc1cc(cc(C)n1)-c1sc(NC(=O)N2CCS(=O)(=O)CC2)nc1-c1cccc(c1)C#N
InChI Key InChIKey=CNJYUMUTVAUOIL-UHFFFAOYSA-N
Data  4 KI
  Tab Delimited (TSV)   2D SDfile   Computed 3D by Vconf -m prep SDfile
Find this compound or compounds like it in BindingDB:
Activity Spreadsheet -- Enzyme Inhibition Constant Data from BindingDB
Found 4 hits for monomerid = 618749
TargetAdenosine receptor A2a(Homo sapiens (Human))
Adorx Therapeutics
US Patent
LigandPNGBDBM618749(US20230293517, Example 4.27)
Affinity DataKi:  0.100nM. Assay description: All FRET binding experiments were conducted at room temperature in white 384-well plates, in assay binding buffer containing 1×LabMed (Cisbio, France...
Ligand InfoPC cidPC sid
In DepthDetails US Patent
TargetAdenosine receptor A2b(Homo sapiens (Human))
Adorx Therapeutics
US Patent
LigandPNGBDBM618749(US20230293517, Example 4.27)
Affinity DataKi:  0.800nM. Assay description: All FRET binding experiments were conducted at room temperature in white 384-well plates, in assay binding buffer containing 1×LabMed (Cisbio, France...
Ligand InfoPC cidPC sid
In DepthDetails US Patent
TargetAdenosine receptor A1(Homo sapiens (Human))
Adorx Therapeutics
US Patent
LigandPNGBDBM618749(US20230293517, Example 4.27)
Affinity DataKi:  6nM. Assay description: All FRET binding experiments were conducted at room temperature in white 384-well plates, in assay binding buffer containing 1×LabMed (Cisbio, France...
Ligand InfoPC cidPC sid
In DepthDetails US Patent
TargetAdenosine receptor A3(Homo sapiens (Human))
Adorx Therapeutics
US Patent
LigandPNGBDBM618749(US20230293517, Example 4.27)
Affinity DataKi:  423nM. Assay description: All FRET binding experiments were conducted at room temperature in white 384-well plates, in assay binding buffer containing 1×LabMed (Cisbio, France...
Ligand InfoPC cidPC sid
In DepthDetails US Patent