BDBM618752 US20230293517, Example 4.30
SMILES Cc1cc(cc(C)n1)-c1sc(NC(=O)N2CC(O)C2)nc1-c1cccc(c1)C#N
InChI Key InChIKey=PKGQALAEOQIFCJ-UHFFFAOYSA-N
Data  4 KI
  Tab Delimited (TSV)   2D SDfile   Computed 3D by Vconf -m prep SDfile
Find this compound or compounds like it in BindingDB:
Activity Spreadsheet -- Enzyme Inhibition Constant Data from BindingDB
Found 4 hits for monomerid = 618752
TargetAdenosine receptor A2a(Homo sapiens (Human))
Adorx Therapeutics
US Patent
LigandPNGBDBM618752(US20230293517, Example 4.30)
Affinity DataKi:  0.410nM. Assay description: All FRET binding experiments were conducted at room temperature in white 384-well plates, in assay binding buffer containing 1×LabMed (Cisbio, France...
Ligand InfoPC cidPC sid
In DepthDetails US Patent
TargetAdenosine receptor A2b(Homo sapiens (Human))
Adorx Therapeutics
US Patent
LigandPNGBDBM618752(US20230293517, Example 4.30)
Affinity DataKi:  0.600nM. Assay description: All FRET binding experiments were conducted at room temperature in white 384-well plates, in assay binding buffer containing 1×LabMed (Cisbio, France...
Ligand InfoPC cidPC sid
In DepthDetails US Patent
TargetAdenosine receptor A1(Homo sapiens (Human))
Adorx Therapeutics
US Patent
LigandPNGBDBM618752(US20230293517, Example 4.30)
Affinity DataKi:  7nM. Assay description: All FRET binding experiments were conducted at room temperature in white 384-well plates, in assay binding buffer containing 1×LabMed (Cisbio, France...
Ligand InfoPC cidPC sid
In DepthDetails US Patent
TargetAdenosine receptor A3(Homo sapiens (Human))
Adorx Therapeutics
US Patent
LigandPNGBDBM618752(US20230293517, Example 4.30)
Affinity DataKi:  106nM. Assay description: All FRET binding experiments were conducted at room temperature in white 384-well plates, in assay binding buffer containing 1×LabMed (Cisbio, France...
Ligand InfoPC cidPC sid
In DepthDetails US Patent