BDBM618770 4-Cyano-N-[4-(3-cyanophenyl)-5-(2,6-dimethyl-4-pyridyl)thiazol-2-yl]-4-methyl-piperidine-1-carboxamide::US20230293517, Example 6
SMILES Cc1cc(cc(C)n1)-c1sc(NC(=O)N2CCC(C)(CC2)C#N)nc1-c1cccc(c1)C#N
InChI Key InChIKey=PFFKSQAULAQWHE-UHFFFAOYSA-N
Data  4 KI
  Tab Delimited (TSV)   2D SDfile   Computed 3D by Vconf -m prep SDfile
Find this compound or compounds like it in BindingDB:
Activity Spreadsheet -- Enzyme Inhibition Constant Data from BindingDB
Found 4 hits for monomerid = 618770
TargetAdenosine receptor A2a(Homo sapiens (Human))
Adorx Therapeutics
US Patent
LigandPNGBDBM618770(4-Cyano-N-[4-(3-cyanophenyl)-5-(2,6-dimethyl-4-pyr...)
Affinity DataKi:  0.120nM. Assay description: All FRET binding experiments were conducted at room temperature in white 384-well plates, in assay binding buffer containing 1×LabMed (Cisbio, France...
Ligand InfoPC cidPC sid
In DepthDetails US Patent
TargetAdenosine receptor A2b(Homo sapiens (Human))
Adorx Therapeutics
US Patent
LigandPNGBDBM618770(4-Cyano-N-[4-(3-cyanophenyl)-5-(2,6-dimethyl-4-pyr...)
Affinity DataKi:  1.10nM. Assay description: All FRET binding experiments were conducted at room temperature in white 384-well plates, in assay binding buffer containing 1×LabMed (Cisbio, France...
Ligand InfoPC cidPC sid
In DepthDetails US Patent
TargetAdenosine receptor A1(Homo sapiens (Human))
Adorx Therapeutics
US Patent
LigandPNGBDBM618770(4-Cyano-N-[4-(3-cyanophenyl)-5-(2,6-dimethyl-4-pyr...)
Affinity DataKi:  37nM. Assay description: All FRET binding experiments were conducted at room temperature in white 384-well plates, in assay binding buffer containing 1×LabMed (Cisbio, France...
Ligand InfoPC cidPC sid
In DepthDetails US Patent
TargetAdenosine receptor A3(Homo sapiens (Human))
Adorx Therapeutics
US Patent
LigandPNGBDBM618770(4-Cyano-N-[4-(3-cyanophenyl)-5-(2,6-dimethyl-4-pyr...)
Affinity DataKi:  283nM. Assay description: All FRET binding experiments were conducted at room temperature in white 384-well plates, in assay binding buffer containing 1×LabMed (Cisbio, France...
Ligand InfoPC cidPC sid
In DepthDetails US Patent