BDBM620559 US20230303513, Example 7
SMILES COCCn1ccc(C)c(N2C[C@H]([C@H](NC(=O)NC3CCc4cc(OC)ccc4C3)C2=O)c2c(F)cc(OC)cc2F)c1=O
InChI Key InChIKey=AVWSFNNXDJWOBL-SNHFLWDVSA-N
Data  2 EC50
  Tab Delimited (TSV)   2D SDfile   Computed 3D by Vconf -m prep SDfile
Find this compound or compounds like it in BindingDB:
Activity Spreadsheet -- Enzyme Inhibition Constant Data from BindingDB
Found 2 hits for monomerid = 620559
TargetfMet-Leu-Phe receptor(Homo sapiens (Human))
Bristol-Myers Squibb
US Patent
LigandPNGBDBM620559(US20230303513, Example 7)
Affinity DataEC50:  0.700nM. Assay description: FPR2 and FPR1 Cyclic Adenosine Monophosphate (cAMP) Assays were used to measure the activity of the compounds in this patent. FPR2 and FPR1 Cyclic Ad...
Ligand InfoPC cidPC sid
In DepthDetails US Patent
TargetN-formyl peptide receptor 2(Homo sapiens (Human))
Bristol-Myers Squibb
US Patent
LigandPNGBDBM620559(US20230303513, Example 7)
Affinity DataEC50:  0.5nM. Assay description: FPR2 and FPR1 Cyclic Adenosine Monophosphate (cAMP) Assays were used to measure the activity of the compounds in this patent. FPR2 and FPR1 Cyclic Ad...
Ligand InfoPC cidPC sid
In DepthDetails US Patent