BDBM631838 US20230348426, Example 108
SMILES COc1ccc(cc1)[C@@H]1CN(C(=O)[C@H]1NC(=O)c1ccc(OC(F)(F)F)cc1)c1c(C)ccn(CCO)c1=O
InChI Key InChIKey=KDEUTNAJDRWTSC-VXKWHMMOSA-N
Data  2 EC50
  Tab Delimited (TSV)   2D SDfile   Computed 3D by Vconf -m prep SDfile
Find this compound or compounds like it in BindingDB:
Activity Spreadsheet -- Enzyme Inhibition Constant Data from BindingDB
Found 2 hits for monomerid = 631838
TargetfMet-Leu-Phe receptor(Homo sapiens (Human))
Bristol-Myers Squibb
US Patent
LigandPNGBDBM631838(US20230348426, Example 108)
Affinity DataEC50:  0.400nM. Assay description:  A mixture of forskolin (5 然 final for FPR2 or 10 然 final for FPR1) and IBMX (200 然 final) were added to 384-well Proxiplates (Perkin-Elmer) pre-d...
Ligand InfoPC cidPC sid
In DepthDetails US Patent
TargetN-formyl peptide receptor 2(Homo sapiens (Human))
Bristol-Myers Squibb
US Patent
LigandPNGBDBM631838(US20230348426, Example 108)
Affinity DataEC50:  2.90nM. Assay description:  A mixture of forskolin (5 然 final for FPR2 or 10 然 final for FPR1) and IBMX (200 然 final) were added to 384-well Proxiplates (Perkin-Elmer) pre-d...
Ligand InfoPC cidPC sid
In DepthDetails US Patent