BDBM631861 US20230348426, Example 131
SMILES COCC(C(=O)N1CCOCC1)n1ccc(C)c(N2C[C@H]([C@H](NC(=O)c3ccc(OC(F)F)cc3)C2=O)c2c(F)cc(OC)cc2F)c1=O
InChI Key InChIKey=GTPMGZYHDYXFGU-UMQIIANQSA-N
Data  2 EC50
  Tab Delimited (TSV)   2D SDfile   Computed 3D by Vconf -m prep SDfile
Find this compound or compounds like it in BindingDB:
Activity Spreadsheet -- Enzyme Inhibition Constant Data from BindingDB
Found 2 hits for monomerid = 631861
TargetfMet-Leu-Phe receptor(Homo sapiens (Human))
Bristol-Myers Squibb
US Patent
LigandPNGBDBM631861(US20230348426, Example 131)
Affinity DataEC50:  0.800nM. Assay description:  A mixture of forskolin (5 然 final for FPR2 or 10 然 final for FPR1) and IBMX (200 然 final) were added to 384-well Proxiplates (Perkin-Elmer) pre-d...
Ligand InfoPC cidPC sid
In DepthDetails US Patent
TargetN-formyl peptide receptor 2(Homo sapiens (Human))
Bristol-Myers Squibb
US Patent
LigandPNGBDBM631861(US20230348426, Example 131)
Affinity DataEC50:  3.40nM. Assay description:  A mixture of forskolin (5 然 final for FPR2 or 10 然 final for FPR1) and IBMX (200 然 final) were added to 384-well Proxiplates (Perkin-Elmer) pre-d...
Ligand InfoPC cidPC sid
In DepthDetails US Patent