BDBM632027 US20230348426, Example 297
SMILES COC(Cn1ccc(C)c(N2C[C@H]([C@H](NC(=O)c3ccc(OC(F)(F)F)cc3)C2=O)c2c(F)cc(OC)cc2F)c1=O)C(F)(F)F
InChI Key InChIKey=OLTHGKPFZLUBFF-IAZWUMQMSA-N
Data  2 EC50
  Tab Delimited (TSV)   2D SDfile   Computed 3D by Vconf -m prep SDfile
Find this compound or compounds like it in BindingDB:
Activity Spreadsheet -- Enzyme Inhibition Constant Data from BindingDB
Found 2 hits for monomerid = 632027
TargetfMet-Leu-Phe receptor(Homo sapiens (Human))
Bristol-Myers Squibb
US Patent
LigandPNGBDBM632027(US20230348426, Example 297)
Affinity DataEC50:  0.100nM. Assay description:  A mixture of forskolin (5 然 final for FPR2 or 10 然 final for FPR1) and IBMX (200 然 final) were added to 384-well Proxiplates (Perkin-Elmer) pre-d...
Ligand InfoPC cidPC sid
In DepthDetails US Patent
TargetN-formyl peptide receptor 2(Homo sapiens (Human))
Bristol-Myers Squibb
US Patent
LigandPNGBDBM632027(US20230348426, Example 297)
Affinity DataEC50:  9nM. Assay description:  A mixture of forskolin (5 然 final for FPR2 or 10 然 final for FPR1) and IBMX (200 然 final) were added to 384-well Proxiplates (Perkin-Elmer) pre-d...
Ligand InfoPC cidPC sid
In DepthDetails US Patent