BDBM632042 US20230348426, Example 312
SMILES COc1ccc([C@@H]2CN(C(=O)[C@H]2NC(=O)c2ccc(OC(F)(F)F)cc2)c2c(C)ccn(CC3CC3)c2=O)c(F)c1
InChI Key InChIKey=VZUGMNNIEWDJKB-UPVQGACJSA-N
Data  2 EC50
  Tab Delimited (TSV)   2D SDfile   Computed 3D by Vconf -m prep SDfile
Find this compound or compounds like it in BindingDB:
Activity Spreadsheet -- Enzyme Inhibition Constant Data from BindingDB
Found 2 hits for monomerid = 632042
TargetfMet-Leu-Phe receptor(Homo sapiens (Human))
Bristol-Myers Squibb
US Patent
LigandPNGBDBM632042(US20230348426, Example 312)
Affinity DataEC50:  0.5nM. Assay description:  A mixture of forskolin (5 然 final for FPR2 or 10 然 final for FPR1) and IBMX (200 然 final) were added to 384-well Proxiplates (Perkin-Elmer) pre-d...
Ligand InfoPC cidPC sid
In DepthDetails US Patent
TargetN-formyl peptide receptor 2(Homo sapiens (Human))
Bristol-Myers Squibb
US Patent
LigandPNGBDBM632042(US20230348426, Example 312)
Affinity DataEC50:  10nM. Assay description:  A mixture of forskolin (5 然 final for FPR2 or 10 然 final for FPR1) and IBMX (200 然 final) were added to 384-well Proxiplates (Perkin-Elmer) pre-d...
Ligand InfoPC cidPC sid
In DepthDetails US Patent