BDBM63374 MLS000123651::N-(4-Cyclopropylsulfamoyl-phenyl)-2-(4-methyl-piperidin-1-yl)-acetamide::N-[4-(cyclopropylsulfamoyl)phenyl]-2-(4-methyl-1-piperidinyl)acetamide;oxalic acid::N-[4-(cyclopropylsulfamoyl)phenyl]-2-(4-methylpiperidin-1-yl)acetamide;oxalic acid::N-[4-(cyclopropylsulfamoyl)phenyl]-2-(4-methylpiperidin-1-yl)ethanamide;ethanedioic acid::N-[4-(cyclopropylsulfamoyl)phenyl]-2-(4-methylpiperidino)acetamide;oxalic acid::SMR000124224::cid_16187052
SMILES CC1CCN(CC(=O)Nc2ccc(cc2)S(=O)(=O)NC2CC2)CC1
InChI Key InChIKey=PBDIMGYCWCHOGE-UHFFFAOYSA-N
Data  1 EC50
  Tab Delimited (TSV)   2D SDfile   Computed 3D by Vconf -m prep SDfile
Find this compound or compounds like it in BindingDB:
Activity Spreadsheet -- Enzyme Inhibition Constant Data from BindingDB
Found 1 hit for monomerid = 63374
TargetHeat shock factor protein 1(Mus musculus)
Broad Institute
Curated by PubChem BioAssay
LigandPNGBDBM63374(MLS000123651 | N-(4-Cyclopropylsulfamoyl-phenyl)-2...)
Affinity DataEC50: >1.95E+5nM. Assay description: Keywords: Heat Shock Factor-1 (HSF-1), Stress Response, MG132, NIH3T3, Luminescence Assay Overview: Modified NIH3T3, transformed to express firefly...
In DepthDetails PCBioAssay