BDBM63380 (4-(benzo[d][1,3]dioxol-5-ylmethyl)piperazin-1-yl)((2R,4R)-4-(4-bromophenyl)-2-(4-hydroxybutoxy)-3,4-dihydro-2H-pyran-6-yl)methanone::MLS000834465::SMR000386254::[(2R,4R)-4-(4-bromophenyl)-2-(4-hydroxybutoxy)-3,4-dihydro-2H-pyran-6-yl]-(4-piperonylpiperazino)methanone::[4-(1,3-benzodioxol-5-ylmethyl)-1-piperazinyl]-[(2R,4R)-4-(4-bromophenyl)-2-(4-hydroxybutoxy)-3,4-dihydro-2H-pyran-6-yl]methanone::[4-(1,3-benzodioxol-5-ylmethyl)piperazin-1-yl]-[(2R,4R)-4-(4-bromophenyl)-2-(4-hydroxybutoxy)-3,4-dihydro-2H-pyran-6-yl]methanone::[4-(1,3-benzodioxol-5-ylmethyl)piperazin-1-yl]-[(2R,4R)-4-(4-bromophenyl)-2-(4-oxidanylbutoxy)-3,4-dihydro-2H-pyran-6-yl]methanone::cid_16187184
SMILES OCCCCO[C@H]1C[C@H](C=C(O1)C(=O)N1CCN(Cc2ccc3OCOc3c2)CC1)c1ccc(Br)cc1
InChI Key InChIKey=IZLJQDMHULWICH-WXVAWEFUSA-N
Data  1 EC50
  Tab Delimited (TSV)   2D SDfile   Computed 3D by Vconf -m prep SDfile
Find this compound or compounds like it in BindingDB:
Activity Spreadsheet -- Enzyme Inhibition Constant Data from BindingDB
Found 1 hit for monomerid = 63380
TargetHeat shock factor protein 1(Mus musculus)
Broad Institute
Curated by PubChem BioAssay
LigandPNGBDBM63380((4-(benzo[d][1,3]dioxol-5-ylmethyl)piperazin-1-yl)...)
Affinity DataEC50: >1.95E+5nM. Assay description: Keywords: Heat Shock Factor-1 (HSF-1), Stress Response, MG132, NIH3T3, Luminescence Assay Overview: Modified NIH3T3, transformed to express firefly...
In DepthDetails PCBioAssay