BDBM63399 3-(3-chlorobenzoyl)-N-propyl-piperidine-1-carboxamide::3-(3-chlorobenzoyl)-N-propylpiperidine-1-carboxamide::3-(3-chlorophenyl)carbonyl-N-propyl-piperidine-1-carboxamide::3-[(3-chlorophenyl)-oxomethyl]-N-propyl-1-piperidinecarboxamide::MLS000734431::SMR000319488::cid_16187590
SMILES CCCNC(=O)N1CCCC(C1)C(=O)c1cccc(Cl)c1
InChI Key InChIKey=FYCIALHNWCYCJC-UHFFFAOYSA-N
Data  1 EC50
  Tab Delimited (TSV)   2D SDfile   Computed 3D by Vconf -m prep SDfile
Find this compound or compounds like it in BindingDB:
Activity Spreadsheet -- Enzyme Inhibition Constant Data from BindingDB
Found 1 hit for monomerid = 63399
TargetHeat shock factor protein 1(Mus musculus)
Broad Institute
Curated by PubChem BioAssay
LigandPNGBDBM63399(3-(3-chlorobenzoyl)-N-propyl-piperidine-1-carboxam...)
Affinity DataEC50: >1.95E+5nM. Assay description: Keywords: Heat Shock Factor-1 (HSF-1), Stress Response, MG132, NIH3T3, Luminescence Assay Overview: Modified NIH3T3, transformed to express firefly...
Ligand InfoPC cidPC sid
In DepthDetails PCBioAssay