BDBM63505 3-[[1-[(4-methoxyphenyl)methyl]-1,2,3,4-tetrazol-5-yl]-(4-methylpiperazin-1-yl)methyl]-8-methyl-1H-quinolin-2-one::3-[[1-[(4-methoxyphenyl)methyl]-5-tetrazolyl]-(4-methyl-1-piperazinyl)methyl]-8-methyl-1H-quinolin-2-one::3-[[1-[(4-methoxyphenyl)methyl]tetrazol-5-yl]-(4-methylpiperazin-1-yl)methyl]-8-methyl-1H-quinolin-2-one::8-methyl-3-[(4-methylpiperazino)-(1-p-anisyltetrazol-5-yl)methyl]carbostyril::MLS000714611::SMR000274590::cid_3182835
SMILES COc1ccc(Cn2nnnc2C(N2CCN(C)CC2)c2cc3cccc(C)c3[nH]c2=O)cc1
InChI Key InChIKey=XJSLYQVFHATNCD-UHFFFAOYSA-N
Data  1 EC50
  Tab Delimited (TSV)   2D SDfile   Computed 3D by Vconf -m prep SDfile
Find this compound or compounds like it in BindingDB:
Activity Spreadsheet -- Enzyme Inhibition Constant Data from BindingDB
Found 1 hit for monomerid = 63505
TargetHeat shock factor protein 1(Mus musculus)
Broad Institute
Curated by PubChem BioAssay
LigandPNGBDBM63505(3-[[1-[(4-methoxyphenyl)methyl]-1,2,3,4-tetrazol-5...)
Affinity DataEC50: >1.95E+5nM. Assay description: Keywords: Heat Shock Factor-1 (HSF-1), Stress Response, MG132, NIH3T3, Luminescence Assay Overview: Modified NIH3T3, transformed to express firefly...
In DepthDetails PCBioAssay