BDBM63672 MLS001006742::N'-[(Z)-2-pyrrolylidenemethyl]-4-(8-quinolinyloxymethyl)benzohydrazide::N'-[(Z)-pyrrol-2-ylidenemethyl]-4-(8-quinolyloxymethyl)benzohydrazide::N'-[(Z)-pyrrol-2-ylidenemethyl]-4-(quinolin-8-yloxymethyl)benzohydrazide::SMR000349704::cid_16195989
SMILES O=C(NN=Cc1ccc[nH]1)c1ccc(COc2cccc3cccnc23)cc1
InChI Key InChIKey=UIPIRPSFXHQIOT-AFUMVMLFSA-N
Data  1 EC50
  Tab Delimited (TSV)   2D SDfile   Computed 3D by Vconf -m prep SDfile
Find this compound or compounds like it in BindingDB:
Activity Spreadsheet -- Enzyme Inhibition Constant Data from BindingDB
Found 1 hit for monomerid = 63672
TargetHeat shock factor protein 1(Mus musculus)
Broad Institute
Curated by PubChem BioAssay
LigandPNGBDBM63672(MLS001006742 | N'-[(Z)-2-pyrrolylidenemethyl]-4-(8...)
Affinity DataEC50:  160nM. Assay description: Keywords: Heat Shock Factor-1 (HSF-1), Stress Response, MG132, NIH3T3, Luminescence Assay Overview: Modified NIH3T3, transformed to express firefly...
In DepthDetails PCBioAssay