BDBM642551 US20230416221, Compound 27
SMILES CC1(C)CNC(=O)c2ccc(cc12)-c1ccnc(Nc2cccc(CS(N)(=O)=O)c2)n1
InChI Key InChIKey=SZZMGLSADKOJKF-UHFFFAOYSA-N
Data  2 IC50
  Tab Delimited (TSV)   2D SDfile   Computed 3D by Vconf -m prep SDfile
Find this compound or compounds like it in BindingDB:
Activity Spreadsheet -- Enzyme Inhibition Constant Data from BindingDB
Found 2 hits for monomerid = 642551
TargetCyclin-T1/Cyclin-dependent kinase 9 [L156F](Homo sapiens (Human))
Hefei Institutes of Physical Science, Chinese Academy of Sciences
US Patent
LigandPNGBDBM642551(US20230416221, Compound 27)
Affinity DataIC50:  125nM. Assay description: The DMSO diluted compounds and the control compounds Dinaciclib, JSH-009, BAY-1211152, AZD4573 (all purchased from MCE, China) were mixed with the de...
Ligand InfoPC cidPC sid
In DepthDetails US Patent
TargetCyclin-T1/Cyclin-dependent kinase 9(Homo sapiens (Human))
Hefei Institutes of Physical Science, Chinese Academy of Sciences
US Patent
LigandPNGBDBM642551(US20230416221, Compound 27)
Affinity DataIC50:  0.890nM. Assay description: The DMSO diluted compounds and the control compounds Dinaciclib, JSH-009, BAY-1211152, AZD4573 (all purchased from MCE, China) were mixed with the de...
Ligand InfoPC cidPC sid
In DepthDetails US Patent