BDBM642569 US20230416221, Compound 96
SMILES CC(=O)N[C@@H]1CCC[C@@H](C1)C(=O)Nc1cc(c(Cl)cn1)-c1ccc2C(=O)NCC(C)(C)c2c1
InChI Key InChIKey=KPSQLGOXCQASJV-DLBZAZTESA-N
Data  1 IC50
  Tab Delimited (TSV)   2D SDfile   Computed 3D by Vconf -m prep SDfile
Find this compound or compounds like it in BindingDB:
Activity Spreadsheet -- Enzyme Inhibition Constant Data from BindingDB
Found 1 hit for monomerid = 642569
TargetCyclin-T1/Cyclin-dependent kinase 9(Homo sapiens (Human))
Hefei Institutes of Physical Science, Chinese Academy of Sciences
US Patent
LigandPNGBDBM642569(US20230416221, Compound 96)
Affinity DataIC50:  0.520nM. Assay description: The DMSO diluted compounds and the control compounds Dinaciclib, JSH-009, BAY-1211152, AZD4573 (all purchased from MCE, China) were mixed with the de...
Ligand InfoPC cidPC sid
In DepthDetails US Patent