BDBM642762 N-(1-(cyclopropylsulfonyl)piperidin-4-yl)-1-isopropyl-1H- [1,2,3]triazolo[4,5-h]quinazolin-8-amine::US20230416271, Compound II.16
SMILES CC(C)n1nnc2ccc3cnc(NC4CCN(CC4)S(=O)(=O)C4CC4)nc3c12
InChI Key InChIKey=IEPWMLWPYJPPOJ-UHFFFAOYSA-N
Data  3 IC50
  Tab Delimited (TSV)   2D SDfile   Computed 3D by Vconf -m prep SDfile
Find this compound or compounds like it in BindingDB:
Activity Spreadsheet -- Enzyme Inhibition Constant Data from BindingDB
Found 3 hits for monomerid = 642762
TargetCyclin-A2/Cyclin-dependent kinase 2(Homo sapiens (Human))
Chengdu Cynogen Bio-Pharmaceutical Technology
US Patent
LigandPNGBDBM642762(N-(1-(cyclopropylsulfonyl)piperidin-4-yl)-1-isopro...)
Affinity DataIC50:  0.200nM. Assay description: Assay of Kinase Activity The inhibitory effect of compounds against the kinase CDK4/cyclin D3 was detected by Caliper Mobility Shift Assay method. Th...
Ligand InfoPC cidPC sid
In DepthDetails US Patent
TargetCyclin-dependent kinase 6/G1/S-specific cyclin-D3(Homo sapiens (Human))
Chengdu Cynogen Bio-Pharmaceutical Technology
US Patent
LigandPNGBDBM642762(N-(1-(cyclopropylsulfonyl)piperidin-4-yl)-1-isopro...)
Affinity DataIC50:  5nM. Assay description: Assay of Kinase Activity The inhibitory effect of compounds against the kinase CDK4/cyclin D3 was detected by Caliper Mobility Shift Assay method. Th...
Ligand InfoPC cidPC sid
In DepthDetails US Patent
TargetCyclin-dependent kinase 4/G1/S-specific cyclin-D3(Homo sapiens (Human))
Chengdu Cynogen Bio-Pharmaceutical Technology
US Patent
LigandPNGBDBM642762(N-(1-(cyclopropylsulfonyl)piperidin-4-yl)-1-isopro...)
Affinity DataIC50:  3nM. Assay description: Assay of Kinase Activity The inhibitory effect of compounds against the kinase CDK4/cyclin D3 was detected by Caliper Mobility Shift Assay method. Th...
Ligand InfoPC cidPC sid
In DepthDetails US Patent