BDBM642768 US20230416271, Compound II.22
SMILES CC(C)n1nnc2cc(F)c3cnc(NC4CCN(CC4)S(C)(=O)=O)nc3c12
InChI Key InChIKey=XQCKNNHFNQYTHZ-UHFFFAOYSA-N
Data  3 IC50
  Tab Delimited (TSV)   2D SDfile   Computed 3D by Vconf -m prep SDfile
Find this compound or compounds like it in BindingDB:
Activity Spreadsheet -- Enzyme Inhibition Constant Data from BindingDB
Found 3 hits for monomerid = 642768
TargetCyclin-A2/Cyclin-dependent kinase 2(Homo sapiens (Human))
Chengdu Cynogen Bio-Pharmaceutical Technology
US Patent
LigandPNGBDBM642768(US20230416271, Compound II.22)
Affinity DataIC50:  0.200nM. Assay description: Assay of Kinase Activity The inhibitory effect of compounds against the kinase CDK4/cyclin D3 was detected by Caliper Mobility Shift Assay method. Th...
Ligand InfoPC cidPC sid
In DepthDetails US Patent
TargetCyclin-dependent kinase 6/G1/S-specific cyclin-D3(Homo sapiens (Human))
Chengdu Cynogen Bio-Pharmaceutical Technology
US Patent
LigandPNGBDBM642768(US20230416271, Compound II.22)
Affinity DataIC50:  4nM. Assay description: Assay of Kinase Activity The inhibitory effect of compounds against the kinase CDK4/cyclin D3 was detected by Caliper Mobility Shift Assay method. Th...
Ligand InfoPC cidPC sid
In DepthDetails US Patent
TargetCyclin-dependent kinase 4/G1/S-specific cyclin-D3(Homo sapiens (Human))
Chengdu Cynogen Bio-Pharmaceutical Technology
US Patent
LigandPNGBDBM642768(US20230416271, Compound II.22)
Affinity DataIC50:  3nM. Assay description: Assay of Kinase Activity The inhibitory effect of compounds against the kinase CDK4/cyclin D3 was detected by Caliper Mobility Shift Assay method. Th...
Ligand InfoPC cidPC sid
In DepthDetails US Patent