BDBM642777 1-isopropyl-N-(1-(methylsulfonyl)piperidin-4-yl)-4-(2,2,2-trifluoro- ethyl)-1H-[1,2,3]triazolo[4,5-h]quinazolin-8-amine::US20230416271, Compound II.31
SMILES CC(C)n1nnc2c(CC(F)(F)F)cc3cnc(NC4CCN(CC4)S(C)(=O)=O)nc3c12
InChI Key InChIKey=JIYCAEUCAZHFNL-UHFFFAOYSA-N
Data  3 IC50
  Tab Delimited (TSV)   2D SDfile   Computed 3D by Vconf -m prep SDfile
Find this compound or compounds like it in BindingDB:
Activity Spreadsheet -- Enzyme Inhibition Constant Data from BindingDB
Found 3 hits for monomerid = 642777
TargetCyclin-A2/Cyclin-dependent kinase 2(Homo sapiens (Human))
Chengdu Cynogen Bio-Pharmaceutical Technology
US Patent
LigandPNGBDBM642777(1-isopropyl-N-(1-(methylsulfonyl)piperidin-4-yl)-4...)
Affinity DataIC50:  0.200nM. Assay description: Assay of Kinase Activity The inhibitory effect of compounds against the kinase CDK4/cyclin D3 was detected by Caliper Mobility Shift Assay method. Th...
Ligand InfoPC cidPC sid
In DepthDetails US Patent
TargetCyclin-dependent kinase 6/G1/S-specific cyclin-D3(Homo sapiens (Human))
Chengdu Cynogen Bio-Pharmaceutical Technology
US Patent
LigandPNGBDBM642777(1-isopropyl-N-(1-(methylsulfonyl)piperidin-4-yl)-4...)
Affinity DataIC50:  2nM. Assay description: Assay of Kinase Activity The inhibitory effect of compounds against the kinase CDK4/cyclin D3 was detected by Caliper Mobility Shift Assay method. Th...
Ligand InfoPC cidPC sid
In DepthDetails US Patent
TargetCyclin-dependent kinase 4/G1/S-specific cyclin-D3(Homo sapiens (Human))
Chengdu Cynogen Bio-Pharmaceutical Technology
US Patent
LigandPNGBDBM642777(1-isopropyl-N-(1-(methylsulfonyl)piperidin-4-yl)-4...)
Affinity DataIC50:  1nM. Assay description: Assay of Kinase Activity The inhibitory effect of compounds against the kinase CDK4/cyclin D3 was detected by Caliper Mobility Shift Assay method. Th...
Ligand InfoPC cidPC sid
In DepthDetails US Patent