BDBM645018 US20240010658, Example 2-6
SMILES CN(C)c1ncc(s1)C(=O)N1C[C@@H]2CC[C@@H](Nc3ccc(Br)nn3)[C@@H]2C1
InChI Key InChIKey=FPRUYTZIJVSTIQ-QJPTWQEYSA-N
Data  1 IC50
  Tab Delimited (TSV)   2D SDfile   Computed 3D by Vconf -m prep SDfile
Find this compound or compounds like it in BindingDB:
Activity Spreadsheet -- Enzyme Inhibition Constant Data from BindingDB
Found 1 hit for monomerid = 645018
TargetMonoacylglycerol lipase ABHD6 [33-337](Homo sapiens (Human))
Ono Pharmaceutical Co.
US Patent
LigandPNGBDBM645018(US20240010658, Example 2-6)
Affinity DataIC50:  2nM. Assay description: First, 1-arachidonoyl glycerol (Cayman Chemical) as a substrate was prepared with an assay buffer containing 50 mM tris-HCl (pH 7.4), 100 mM NaCl, an...
Ligand InfoPC cidPC sid
In DepthDetails US Patent