BDBM645020 US20240010658, Example 3
SMILES CN1c2cc(sc2CCC1=O)C(=O)N1C[C@@H]2CC[C@@H](Nc3ccc(Br)nn3)[C@@H]2C1
InChI Key InChIKey=NQGDDHBMANDKHA-YNEHKIRRSA-N
Data  1 IC50
  Tab Delimited (TSV)   2D SDfile   Computed 3D by Vconf -m prep SDfile
Find this compound or compounds like it in BindingDB:
Activity Spreadsheet -- Enzyme Inhibition Constant Data from BindingDB
Found 1 hit for monomerid = 645020
TargetMonoacylglycerol lipase ABHD6 [33-337](Homo sapiens (Human))
Ono Pharmaceutical Co.
US Patent
LigandPNGBDBM645020(US20240010658, Example 3)
Affinity DataIC50:  5nM. Assay description: First, 1-arachidonoyl glycerol (Cayman Chemical) as a substrate was prepared with an assay buffer containing 50 mM tris-HCl (pH 7.4), 100 mM NaCl, an...
Ligand InfoPC cidPC sid
In DepthDetails US Patent