BDBM645027 US20240010658, Example 8-1
SMILES Cc1ccc(s1)C(=O)N1C[C@@H]2CC[C@H]([C@@H]2C1)n1ccc2cc(Cl)nnc12
InChI Key InChIKey=JYYGEKBIXMEXFP-RRFJBIMHSA-N
Data  1 IC50
  Tab Delimited (TSV)   2D SDfile   Computed 3D by Vconf -m prep SDfile
Find this compound or compounds like it in BindingDB:
Activity Spreadsheet -- Enzyme Inhibition Constant Data from BindingDB
Found 1 hit for monomerid = 645027
TargetMonoacylglycerol lipase ABHD6 [33-337](Homo sapiens (Human))
Ono Pharmaceutical Co.
US Patent
LigandPNGBDBM645027(US20240010658, Example 8-1)
Affinity DataIC50:  1nM. Assay description: First, 1-arachidonoyl glycerol (Cayman Chemical) as a substrate was prepared with an assay buffer containing 50 mM tris-HCl (pH 7.4), 100 mM NaCl, an...
Ligand InfoPC cidPC sid
In DepthDetails US Patent