BDBM647309 US20240025892, Example 16
SMILES CC1(COc2ccc3n(cnc3c2)-c2ccc3cccc(C4CCNC4)c3n2)COC1
InChI Key InChIKey=QYFGVVMJUHWKNB-UHFFFAOYSA-N
Data  3 IC50
  Tab Delimited (TSV)   2D SDfile   Computed 3D by Vconf -m prep SDfile
Find this compound or compounds like it in BindingDB:
Activity Spreadsheet -- Enzyme Inhibition Constant Data from BindingDB
Found 3 hits for monomerid = 647309
TargetSerine/threonine-protein kinase SIK2(Homo sapiens (Human))
The General Hospital
US Patent
LigandPNGBDBM647309(US20240025892, Example 16)
Affinity DataIC50:  3.39nM. Assay description: Assays were performed in base reaction buffer (20 mM Hepes (pH 7.5), 10 mM MgCl2, 1 mM EGTA, 0.02% Brij35, 0.02 mg/mL BSA, 0.1 mM Na3VO4, 2 mM DTT, 1...
Ligand InfoPC cidPC sid
In DepthDetails US Patent
TargetSerine/threonine-protein kinase SIK1(Homo sapiens (Human))
The General Hospital
US Patent
LigandPNGBDBM647309(US20240025892, Example 16)
Affinity DataIC50:  16.7nM. Assay description: Assays were performed in base reaction buffer (20 mM Hepes (pH 7.5), 10 mM MgCl2, 1 mM EGTA, 0.02% Brij35, 0.02 mg/mL BSA, 0.1 mM Na3VO4, 2 mM DTT, 1...
Ligand InfoPC cidPC sid
In DepthDetails US Patent
TargetSerine/threonine-protein kinase SIK3(Homo sapiens)
The General Hospital
US Patent
LigandPNGBDBM647309(US20240025892, Example 16)
Affinity DataIC50:  4.44nM. Assay description: Assays were performed in base reaction buffer (20 mM Hepes (pH 7.5), 10 mM MgCl2, 1 mM EGTA, 0.02% Brij35, 0.02 mg/mL BSA, 0.1 mM Na3VO4, 2 mM DTT, 1...
Ligand InfoPC cidPC sid
In DepthDetails US Patent