BDBM647333 2,6-dimethoxy-4-(7-((3- methyloxetan-3- yl)methoxy)imidazo[1,2- a]pyridin-3- yl)benzonitrile::US20240025892, Example 40
SMILES COc1cc(cc(OC)c1C#N)-c1cnc2cc(OCC3(C)COC3)ccn12
InChI Key InChIKey=OFTFSUSLBYXVNX-UHFFFAOYSA-N
Data  1 IC50
  Tab Delimited (TSV)   2D SDfile   Computed 3D by Vconf -m prep SDfile
Find this compound or compounds like it in BindingDB:
Activity Spreadsheet -- Enzyme Inhibition Constant Data from BindingDB
Found 1 hit for monomerid = 647333
TargetSerine/threonine-protein kinase SIK2(Homo sapiens (Human))
The General Hospital
US Patent
LigandPNGBDBM647333(2,6-dimethoxy-4-(7-((3- methyloxetan-3- yl)methoxy...)
Affinity DataIC50:  9.87nM. Assay description: Assays were performed in base reaction buffer (20 mM Hepes (pH 7.5), 10 mM MgCl2, 1 mM EGTA, 0.02% Brij35, 0.02 mg/mL BSA, 0.1 mM Na3VO4, 2 mM DTT, 1...
Ligand InfoPC cidPC sid
In DepthDetails US Patent