BDBM647347 4-(6-(1-cyclopropyl- 1H-pyrazol-4- yl)pyrazolo[1,5- a]pyridin-3- yl)benzonitrile::US20240025892, Example 54
SMILES N#Cc1ccc(cc1)-c1cnn2cc(ccc12)-c1cnn(c1)C1CC1
InChI Key InChIKey=KJRMLVHNODMQLX-UHFFFAOYSA-N
Data  1 IC50
  Tab Delimited (TSV)   2D SDfile   Computed 3D by Vconf -m prep SDfile
Find this compound or compounds like it in BindingDB:
Activity Spreadsheet -- Enzyme Inhibition Constant Data from BindingDB
Found 1 hit for monomerid = 647347
TargetSerine/threonine-protein kinase SIK2(Homo sapiens (Human))
The General Hospital
US Patent
LigandPNGBDBM647347(4-(6-(1-cyclopropyl- 1H-pyrazol-4- yl)pyrazolo[1,5...)
Affinity DataIC50:  2.24nM. Assay description: Assays were performed in base reaction buffer (20 mM Hepes (pH 7.5), 10 mM MgCl2, 1 mM EGTA, 0.02% Brij35, 0.02 mg/mL BSA, 0.1 mM Na3VO4, 2 mM DTT, 1...
Ligand InfoPC cidPC sid
In DepthDetails US Patent