BDBM6519 4-[(2,4-dichloro-5-methoxyphenyl)amino]-6-methoxy-7-[2-(pyridin-3-yl)ethynyl]quinoline-3-carbonitrile::ethynyl-4-phenylamino-3-quinolinecarbonitrile 3a
SMILES COc1cc(Nc2c(cnc3cc(C#Cc4cccnc4)c(OC)cc23)C#N)c(Cl)cc1Cl
InChI Key InChIKey=RWLDBVRQBAPJBL-UHFFFAOYSA-N
Data  1 IC50
  Tab Delimited (TSV)   2D SDfile   Computed 3D by Vconf -m prep SDfile
Find this compound or compounds like it in BindingDB:
Activity Spreadsheet -- Enzyme Inhibition Constant Data from BindingDB
Found 1 hit for monomerid = 6519
TargetProto-oncogene tyrosine-protein kinase Src(Homo sapiens (Human))
Wyeth-Ayerst Research
LigandPNGBDBM6519(4-[(2,4-dichloro-5-methoxyphenyl)amino]-6-methoxy-...)
Affinity DataIC50:  12nMpH: 7.5 T: 2°C. Assay description: Kinase assays were performed using the europium/APC detection format (LANCE, Perkin Elmer). HTRF is based on the proximity of europium cryptate (dono...
In DepthDetails ArticlePubMed