BDBM6535 4-[(2,4-dichloro-5-methoxyphenyl)amino]-7-[(E)-2-(1H-imidazol-1-yl)ethenyl]quinoline-3-carbonitrile::ethenyl-4-phenylamino-3-quinolinecarbonitrile 19a
SMILES COc1cc(Nc2c(cnc3cc(\C=C\n4ccnc4)ccc23)C#N)c(Cl)cc1Cl
InChI Key InChIKey=OYGZJKLFSBNKHN-GQCTYLIASA-N
Data  1 IC50
  Tab Delimited (TSV)   2D SDfile   Computed 3D by Vconf -m prep SDfile
Find this compound or compounds like it in BindingDB:
Activity Spreadsheet -- Enzyme Inhibition Constant Data from BindingDB
Found 1 hit for monomerid = 6535
TargetProto-oncogene tyrosine-protein kinase Src(Homo sapiens (Human))
Wyeth-Ayerst Research
LigandPNGBDBM6535(4-[(2,4-dichloro-5-methoxyphenyl)amino]-7-[(E)-2-(...)
Affinity DataIC50:  6.60nM. Assay description: Kinase assays were performed using the europium/APC detection format (LANCE, Perkin Elmer). HTRF is based on the proximity of europium cryptate (dono...
In DepthDetails ArticlePubMed